×

Discussion Board

Results 1 to 4 of 4
  1. #1
    Registered User
    Join Date
    May 2007
    Posts
    5

    Carbide.c++ 1.2 Series 60 Symbian 9.2 build eror

    Maybe my problem not hard for you, but I'm beginner. I have install Nokia SDK for Series 60 Symbian 9.2, Perl as described in Installation notes and ofcoarse Carbide.c++ 1.2 express

    So my problem here:
    1) I run Carbide.c++
    2) Make FILE -> NEW -> Symbian OS C++ project
    3) There I select name for new project - TestUi with enabled chechbox (as default)
    4) Press next and select Symbian Executale Project and there select S60 3.x GUI Application and Next, Finish.

    Then I make PROJECTS -> Build project.

    After some timeof compiling I see in "Problems window" next data:

    make[1]: *** No rule to make target `\Symbian\9.2\S60_3rd_FP1_4\EPOC32\BUILD\Symbian\Carbide\workspace\TestUi\group\TESTUI\WINSCW\TESTUI.WINSCW'. Stop.



    ***Building project "TestUi" for configuration "Emulator Debug (WINSCW) [S60_3rd_FP1_4]"

    ***Printing environment variables modified from default:
    MWCSYM2INCLUDES=D:\Nokia\Carbide.c++\x86Build\Symbian_Support\MSL\MSL_C\MSL_Common\Include;D:\Nokia\Carbide.c++\x86Build\Symbian_Support\MSL\MSL_C\MSL_Win32\Include;D:\Nokia\Carbide.c++\x86Build\Symbian_Support\MSL\MSL_C\MSL_X86;D:\Nokia\Carbide.c++\x86Build\Symbian_Support\MSL\MSL_C++\MSL_Common\Include;+D:\Nokia\Carbide.c++\x86Build\Symbian_Support\MSL\MSL_Extras\MSL_Common\Include;D:\Nokia\Carbide.c++\x86Build\Symbian_Support\MSL\MSL_Extras\MSL_Win32\Include;D:\Nokia\Carbide.c++\x86Build\Symbian_Support\Win32-x86 Support\Headers\Win32 SDK;
    MWSYM2LIBRARIES=D:\Nokia\Carbide.c++\x86Build\Symbian_Support\Win32-x86 Support\Libraries\Win32 SDK;D:\Nokia\Carbide.c++\x86Build\Symbian_Support\Runtime\Runtime_x86\Runtime_Win32\Libs
    PATH=D:\Nokia\Carbide.c++\x86Build\Symbian_Tools\Command_Line_Tools;C:\Symbian\9.2\S60_3rd_FP1_4\epoc32\tools;C:\Symbian\9.2\S60_3rd_FP1_4\epoc32\gcc\bin;C:\Program Files\Common Files\Symbian\Tools;E:\Program Files\CSL Arm Toolchain\bin;C:\Perl\site\bin;C:\Perl\bin;D:\Program Files\Nokia\Carbide.c++ v1.2\x86Build\Symbian_Tools\Command_Line_Tools;E:\Program Files\PHP\;E:\Nokia\Carbide_j_1_5\bin;E:\Nokia\Carbide_j_1_5\bin;E:\Nokia\Carbide_j_1_5\bin;E:\Nokia\Carbide_j_1_5\bin;E:\ruby\bin;C:\WINDOWS\system32;C:\WINDOWS;C:\WINDOWS\System32\Wbem;C:\Program Files\PC-Doctor for Windows\services;C:\Program Files\Java\jdk1.5.0\bin;C:\Program Files\Intuwave\Shared\mRouterRuntime;C:\Nokia\Update_Manager\bin;E:\Program Files\PHP;E:\Program Files\PHP\ext;
    EPOCROOT=\Symbian\9.2\S60_3rd_FP1_4\

    Working Directory: C:/Symbian/Carbide/workspace/TestUi/group

    *** Makefile structures up to date. Skipping 'bldmake bldfiles'

    ===Build Command = /c abld build WINSCW UDEB -v===
    C:\WINDOWS\system32\cmd.exe /c abld build WINSCW UDEB -v
    make -r -f "\Symbian\9.2\S60_3rd_FP1_4\EPOC32\BUILD\Symbian\Carbide\workspace\TestUi\group\EXPORT.make" EXPORT
    Nothing to do
    make -r -f "\Symbian\9.2\S60_3rd_FP1_4\EPOC32\BUILD\Symbian\Carbide\workspace\TestUi\group\WINSCW.make" MAKEFILE
    Bareword found where operator expected at C:/Symbian/9.2/S60_3rd_FP1_4/epoc32/tools/perllib/params.pm line 461, near "New CParamItem"
    (Do you need to predeclare New?)
    Bareword found where operator expected at C:/Symbian/9.2/S60_3rd_FP1_4/epoc32/tools/perllib/params.pm line 466, near "New CParamItem"
    (Do you need to predeclare New?)
    syntax error at C:/Symbian/9.2/S60_3rd_FP1_4/epoc32/tools/perllib/params.pm line 461, near "New CParamItem"
    syntax error at C:/Symbian/9.2/S60_3rd_FP1_4/epoc32/tools/perllib/params.pm line 466, near "New CParamItem"
    Compilation failed in require at C:/Symbian/9.2/S60_3rd_FP1_4/epoc32/tools/perllib/args.pm line 19.
    BEGIN failed--compilation aborted at C:/Symbian/9.2/S60_3rd_FP1_4/epoc32/tools/perllib/args.pm line 19.
    Compilation failed in require at C:\Symbian\9.2\S60_3rd_FP1_4\epoc32\tools/cshlpcmp.pl line 58.
    BEGIN failed--compilation aborted at C:\Symbian\9.2\S60_3rd_FP1_4\epoc32\tools/cshlpcmp.pl line 58.
    make[1]: *** [MAKMAKE] Error 255
    make: *** [MAKEFILEBUILD_HELP] Error 2
    make -C \Symbian\Carbide\workspace\TestUi\group -f "ICONS_SCALABLE_DC.MK" TO_ROOT=..\..\..\..\.. EPOCBLD=..\..\..\..\..\Symbian\9.2\S60_3rd_FP1_4\EPOC32\BUILD\Symbian\Carbide\workspace\TestUi\group\ICONS_SCALABLE_DC\WINSCW TO_BLDINF=..\..\..\..\..\Symbian\Carbide\workspace\TestUi\group PLATFORM=WINSCW MAKMAKE
    make[1]: Entering directory `C:/Symbian/Carbide/workspace/TestUi/group'
    make[1]: Leaving directory `C:/Symbian/Carbide/workspace/TestUi/group'
    make -C \Symbian\Carbide\workspace\TestUi\HELP -f "BUILD_HELP.MK" TO_ROOT=..\..\..\..\.. EPOCBLD=..\..\..\..\..\Symbian\9.2\S60_3rd_FP1_4\EPOC32\BUILD\Symbian\Carbide\workspace\TestUi\group\BUILD_HELP\WINSCW TO_BLDINF=..\..\..\..\..\Symbian\Carbide\workspace\TestUi\group PLATFORM=WINSCW MAKMAKE
    make[1]: Entering directory `C:/Symbian/Carbide/workspace/TestUi/HELP'
    cshlpcmp TestUi.cshlp
    make[1]: Leaving directory `C:/Symbian/Carbide/workspace/TestUi/HELP'
    make -r -f "\Symbian\9.2\S60_3rd_FP1_4\EPOC32\BUILD\Symbian\Carbide\workspace\TestUi\group\WINSCW.make" LIBRARY
    make[1]: \Symbian\9.2\S60_3rd_FP1_4\EPOC32\BUILD\Symbian\Carbide\workspace\TestUi\group\TESTUI\WINSCW\TESTUI.WINSCW: No such file or directory
    make[1]: *** No rule to make target `\Symbian\9.2\S60_3rd_FP1_4\EPOC32\BUILD\Symbian\Carbide\workspace\TestUi\group\TESTUI\WINSCW\TESTUI.WINSCW'. Stop.
    make: *** [LIBRARYTESTUI] Error 2
    make -C \Symbian\Carbide\workspace\TestUi\group -f "ICONS_SCALABLE_DC.MK" TO_ROOT=..\..\..\..\.. EPOCBLD=..\..\..\..\..\Symbian\9.2\S60_3rd_FP1_4\EPOC32\BUILD\Symbian\Carbide\workspace\TestUi\group\ICONS_SCALABLE_DC\WINSCW TO_BLDINF=..\..\..\..\..\Symbian\Carbide\workspace\TestUi\group PLATFORM=WINSCW LIB
    make[1]: Entering directory `C:/Symbian/Carbide/workspace/TestUi/group'
    make[1]: Leaving directory `C:/Symbian/Carbide/workspace/TestUi/group'
    make -C \Symbian\Carbide\workspace\TestUi\HELP -f "BUILD_HELP.MK" TO_ROOT=..\..\..\..\.. EPOCBLD=..\..\..\..\..\Symbian\9.2\S60_3rd_FP1_4\EPOC32\BUILD\Symbian\Carbide\workspace\TestUi\group\BUILD_HELP\WINSCW TO_BLDINF=..\..\..\..\..\Symbian\Carbide\workspace\TestUi\group PLATFORM=WINSCW LIB
    make[1]: Entering directory `C:/Symbian/Carbide/workspace/TestUi/HELP'
    make[1]: Leaving directory `C:/Symbian/Carbide/workspace/TestUi/HELP'
    make -r -f "\Symbian\9.2\S60_3rd_FP1_4\EPOC32\BUILD\Symbian\Carbide\workspace\TestUi\group\TESTUI\WINSCW\TESTUI.WINSCW" LIBRARY
    make[1]: Entering directory `C:/Symbian/Carbide/workspace/TestUi/group'
    make[1]: Leaving directory `C:/Symbian/Carbide/workspace/TestUi/group'
    make -r -f "\Symbian\9.2\S60_3rd_FP1_4\EPOC32\BUILD\Symbian\Carbide\workspace\TestUi\group\WINSCW.make" RESOURCE CFG=UDEB
    make[1]: \Symbian\9.2\S60_3rd_FP1_4\EPOC32\BUILD\Symbian\Carbide\workspace\TestUi\group\TESTUI\WINSCW\TESTUI.WINSCW: No such file or directory
    make[1]: *** No rule to make target `\Symbian\9.2\S60_3rd_FP1_4\EPOC32\BUILD\Symbian\Carbide\workspace\TestUi\group\TESTUI\WINSCW\TESTUI.WINSCW'. Stop.
    make: *** [RESOURCETESTUI] Error 2
    make -C \Symbian\Carbide\workspace\TestUi\group -f "ICONS_SCALABLE_DC.MK" TO_ROOT=..\..\..\..\.. EPOCBLD=..\..\..\..\..\Symbian\9.2\S60_3rd_FP1_4\EPOC32\BUILD\Symbian\Carbide\workspace\TestUi\group\ICONS_SCALABLE_DC\WINSCW TO_BLDINF=..\..\..\..\..\Symbian\Carbide\workspace\TestUi\group PLATFORM=WINSCW CFG=UDEB RESOURCE
    make[1]: Entering directory `C:/Symbian/Carbide/workspace/TestUi/group'
    mifconv \Symbian\9.2\S60_3rd_FP1_4\epoc32\release\WINSCW\UDEB\Z\resource\apps\TestUi_0xEA62B549.mif \
    /c32 ..\gfx\qgn_menu_TestUi.svg
    MifConv version 1.11 build (39).
    Checking: ..\gfx\qgn_menu_TestUi.svg
    Choosing...
    Convert files...
    .

  2. #2
    Registered User
    Join Date
    May 2007
    Posts
    5

    Re: Carbide.c++ 1.2 Series 60 Symbian 9.2 build eror

    Loading mif icons...
    Loading file: \Symbian\9.2\S60_3rd_FP1_4\epoc32\winscw\c\system\temp\s12g.tmp\.._gfx_qgn_menu_TestUi.svgb
    Writing mif: \Symbian\9.2\S60_3rd_FP1_4\epoc32\release\WINSCW\UDEB\Z\resource\apps\TestUi_0xEA62B549.mif
    make[1]: Leaving directory `C:/Symbian/Carbide/workspace/TestUi/group'
    make -C \Symbian\Carbide\workspace\TestUi\HELP -f "BUILD_HELP.MK" TO_ROOT=..\..\..\..\.. EPOCBLD=..\..\..\..\..\Symbian\9.2\S60_3rd_FP1_4\EPOC32\BUILD\Symbian\Carbide\workspace\TestUi\group\BUILD_HELP\WINSCW TO_BLDINF=..\..\..\..\..\Symbian\Carbide\workspace\TestUi\group PLATFORM=WINSCW CFG=UDEB RESOURCE
    make[1]: Entering directory `C:/Symbian/Carbide/workspace/TestUi/HELP'
    make[1]: Leaving directory `C:/Symbian/Carbide/workspace/TestUi/HELP'
    make -r -f "\Symbian\9.2\S60_3rd_FP1_4\EPOC32\BUILD\Symbian\Carbide\workspace\TestUi\group\TESTUI\WINSCW\TESTUI.WINSCW" RESOURCEUDEB
    make[1]: Entering directory `C:/Symbian/Carbide/workspace/TestUi/group'
    make[1]: Leaving directory `C:/Symbian/Carbide/workspace/TestUi/group'
    make -r -f "\Symbian\9.2\S60_3rd_FP1_4\EPOC32\BUILD\Symbian\Carbide\workspace\TestUi\group\WINSCW.make" TARGET CFG=UDEB
    make[1]: \Symbian\9.2\S60_3rd_FP1_4\EPOC32\BUILD\Symbian\Carbide\workspace\TestUi\group\TESTUI\WINSCW\TESTUI.WINSCW: No such file or directory
    make[1]: *** No rule to make target `\Symbian\9.2\S60_3rd_FP1_4\EPOC32\BUILD\Symbian\Carbide\workspace\TestUi\group\TESTUI\WINSCW\TESTUI.WINSCW'. Stop.
    make: *** [TARGETTESTUI] Error 2
    make -C \Symbian\Carbide\workspace\TestUi\group -f "ICONS_SCALABLE_DC.MK" TO_ROOT=..\..\..\..\.. EPOCBLD=..\..\..\..\..\Symbian\9.2\S60_3rd_FP1_4\EPOC32\BUILD\Symbian\Carbide\workspace\TestUi\group\ICONS_SCALABLE_DC\WINSCW TO_BLDINF=..\..\..\..\..\Symbian\Carbide\workspace\TestUi\group PLATFORM=WINSCW CFG=UDEB BLD
    make[1]: Entering directory `C:/Symbian/Carbide/workspace/TestUi/group'
    make[1]: Leaving directory `C:/Symbian/Carbide/workspace/TestUi/group'
    make -C \Symbian\Carbide\workspace\TestUi\HELP -f "BUILD_HELP.MK" TO_ROOT=..\..\..\..\.. EPOCBLD=..\..\..\..\..\Symbian\9.2\S60_3rd_FP1_4\EPOC32\BUILD\Symbian\Carbide\workspace\TestUi\group\BUILD_HELP\WINSCW TO_BLDINF=..\..\..\..\..\Symbian\Carbide\workspace\TestUi\group PLATFORM=WINSCW CFG=UDEB BLD
    make[1]: Entering directory `C:/Symbian/Carbide/workspace/TestUi/HELP'
    make[1]: Leaving directory `C:/Symbian/Carbide/workspace/TestUi/HELP'
    make -r -f "\Symbian\9.2\S60_3rd_FP1_4\EPOC32\BUILD\Symbian\Carbide\workspace\TestUi\group\TESTUI\WINSCW\TESTUI.WINSCW" UDEB
    make[1]: Entering directory `C:/Symbian/Carbide/workspace/TestUi/group'
    make[1]: Leaving directory `C:/Symbian/Carbide/workspace/TestUi/group'
    make -r -f "\Symbian\9.2\S60_3rd_FP1_4\EPOC32\BUILD\Symbian\Carbide\workspace\TestUi\group\WINSCW.make" FINAL CFG=UDEB
    make -C \Symbian\Carbide\workspace\TestUi\group -f "ICONS_SCALABLE_DC.MK" TO_ROOT=..\..\..\..\.. EPOCBLD=..\..\..\..\..\Symbian\9.2\S60_3rd_FP1_4\EPOC32\BUILD\Symbian\Carbide\workspace\TestUi\group\ICONS_SCALABLE_DC\WINSCW TO_BLDINF=..\..\..\..\..\Symbian\Carbide\workspace\TestUi\group PLATFORM=WINSCW CFG=UDEB FINAL
    make[1]: Entering directory `C:/Symbian/Carbide/workspace/TestUi/group'
    make[1]: Leaving directory `C:/Symbian/Carbide/workspace/TestUi/group'
    make -C \Symbian\Carbide\workspace\TestUi\HELP -f "BUILD_HELP.MK" TO_ROOT=..\..\..\..\.. EPOCBLD=..\..\..\..\..\Symbian\9.2\S60_3rd_FP1_4\EPOC32\BUILD\Symbian\Carbide\workspace\TestUi\group\BUILD_HELP\WINSCW TO_BLDINF=..\..\..\..\..\Symbian\Carbide\workspace\TestUi\group PLATFORM=WINSCW CFG=UDEB FINAL
    make[1]: Entering directory `C:/Symbian/Carbide/workspace/TestUi/HELP'
    make[1]: Leaving directory `C:/Symbian/Carbide/workspace/TestUi/HELP'

    ***Build Complete

    ***Errors were detected in build. See the Problems or Console view for details.

    Total Time: 2 sec

  3. #3
    Nokia Developer Expert
    Join Date
    Dec 2004
    Location
    Austin, TX
    Posts
    399

    Re: Carbide.c++ 1.2 Series 60 Symbian 9.2 build eror

    You have the wrong version of Perl it appears.
    You can either get perl 5.6.1 or read details if you want to update your Perl scripts.

    http://discussion.forum.nokia.com/fo...272#post187272

    Tim

  4. #4
    Registered User
    Join Date
    May 2007
    Posts
    5

    Re: Carbide.c++ 1.2 Series 60 Symbian 9.2 build eror

    thank you,timm-ah! I had changed my perl to 5.6.1 and build the application!

Similar Threads

  1. Series 60 SDK for Symbian v0.9 - Cannot build binaries
    By theLauronen in forum Symbian Tools & SDKs
    Replies: 5
    Last Post: 2007-01-19, 18:06
  2. Debugging Symbian S60 with Carbide C++ Express and NCF 1.2 Bluetooth
    By jimgilmour1 in forum Bluetooth Technology
    Replies: 4
    Last Post: 2006-09-05, 19:30
  3. Series 60Series 60 MIDP Concept SDK Beta 0.2 Linux bug?
    By kauppi in forum Mobile Java Tools & SDKs
    Replies: 3
    Last Post: 2003-04-07, 09:05
  4. Symbian - Series 60 - the future?
    By markcaz in forum Symbian C++
    Replies: 1
    Last Post: 2002-11-28, 14:30
  5. Deploying Java apps to Symbian C++ toolkit Series 60 emulator?
    By teapot7 in forum Mobile Java Tools & SDKs
    Replies: 0
    Last Post: 2002-08-07, 05:44

Posting Permissions

  • You may not post new threads
  • You may not post replies
  • You may not post attachments
  • You may not edit your posts
  •