×

Discussion Board

Results 1 to 3 of 3
  1. #1
    Registered User
    Join Date
    Jun 2012
    Location
    Hull, United Kingdom
    Posts
    48

    Issue with App builidng after implementing Screenshot class with Qt

    I keep getting weird compile errors when trying to compile the app with the Publish to Nokia Store tool,
    I have added the ScreenClass.cpp from http://developer.nokia.com/Community...eenShot_Qt/QML


    My build log is on the following link (it wouldn't let me post the full thing, character limits)

    http://www.allstarsoftware.x10.mx/buildlog

    I'm using Windows 8 with a clean installation of the latest Qt SDK

    If anyone can help it will be greatly appreciated

    Thanks,

    Allstar
    Check out my Symbian, Series 40 Apps on Nokia store !
    http://store.ovi.com/publisher/Allstar%20Software/

  2. #2
    Nokia Developer Moderator
    Join Date
    Feb 2006
    Location
    Budapest, Hungary
    Posts
    28,568

    Re: Issue with App builidng after implementing Screenshot class with Qt

    What is weird with it?
    Here is how you interpret the build log:
    - open your link
    - press Ctrl-F ("Find" in most browsers on Windows, if you are using something else, use the appropriate key combination or menu item)
    - type error, press Enter if the given browser needs that
    - first occurrence is going to be "no warnings or errors" after the clean step at the very beginning, this is not what you need
    - second occurrence says "C:/Users/me/FacebookTouchQt/ScreenClass.cpp:2: fatal error: ScreenClass.h: No such file or directory".
    Do you have ScreenClass.h somewhere? Your link actually has it, but you mention the .cpp only in your question. And ScreenClass.cpp really starts with #include "ScreenClass.h".

  3. #3
    Registered User
    Join Date
    Jun 2012
    Location
    Hull, United Kingdom
    Posts
    48

    Re: Issue with App builidng after implementing Screenshot class with Qt

    Once I add the header, It starts to give me this error:
    " C:/Users/me/FacebookTouchQt/ScreenClass.cpp:15: error: invalid operands of types 'const char [26]' and 'const char [11]' to binary 'operator+'"
    then the "
    FAILED compile for arm.v5.urel.gcce4_4_1: ScreenClass.cpp
    mmp: FacebookTouchQt_exe.mmp
    mingw32-make[1]: *** [C:/QtSDK/Symbian/SDKs/Symbian3Qt474/epoc32/build/facebooktouchqt/c_4b72e24f693f6269/FacebookTouchQt_exe/armv5/urel/ScreenClass.o] Error 1
    mingw32-make[1]: *** Waiting for unfinished jobs....
    sbs: error: The make-engine exited with errors.
    C:\QtSDK\Symbian\SDKs\Symbian3Qt474\epoc32\tools\make.exe: *** [release-gcce] Error 1
    "

    At the very end,

    I'm not good at all with C++ stuff so bare with me if I sound like a complete noob.
    Check out my Symbian, Series 40 Apps on Nokia store !
    http://store.ovi.com/publisher/Allstar%20Software/

Similar Threads

  1. FileConnection class issue
    By freakenstien in forum Mobile Java General
    Replies: 1
    Last Post: 2011-04-29, 06:45
  2. A Base class access issue
    By vinp in forum Symbian Tools & SDKs
    Replies: 1
    Last Post: 2010-11-29, 10:06
  3. Issue in singleton class
    By pawan_G in forum Symbian
    Replies: 6
    Last Post: 2009-01-30, 04:08
  4. RPositioner class issue
    By songoku83 in forum Symbian
    Replies: 6
    Last Post: 2008-08-04, 08:07
  5. implementing sms class zero messages on phones and smsc
    By oshwa_ish in forum General Messaging
    Replies: 0
    Last Post: 2007-05-18, 17:57

Posting Permissions

  • You may not post new threads
  • You may not post replies
  • You may not post attachments
  • You may not edit your posts
  •