×

Discussion Board

Results 1 to 3 of 3
  1. #1
    Registered User
    Join Date
    Jun 2004
    Posts
    25

    Problems with NDS_symbian_ vs 1.1, cannot complied examples in SDK

    Hi,

    I came across a strange problem with NDS 1.1.

    My environment is as follows:
    1. SDK
    Nokia 6600 camera plugin;
    S60 V20 SDK for vs.net
    2. VS.net 2003
    3. NDS 1.1

    Problem:
    1. Cannot make WINS build if creating a project by wizards, ARMI and THUMB build work well.

    The error message during WINS build is as follows,
    **
    ''Symbian1 : error PRJ0003 : error during generating “cl.exe”.''
    **
    Note: My vs.net is Chinese version, so I translate the error message to English for easier understanding.


    2. Cannot make WINS/ARMI/THUMB build if importing an example from SDK, such as CameraSnapshot.

    The error message during WINS build is like the one above,
    **
    ''CameraSnapShot : error PRJ0003 : error during generating “cl.exe”.''
    **
    Note: My vs.net is Chinese version, so I translate the error message to English for easier understanding.


    The error message during ARMI build is ,
    **
    gcc -s -fomit-frame-pointer -O -march=armv4t -mthumb-interwork -pipe -c -nostdinc -Wall -Wno-ctor-dtor-privacy -Wno-unknown-pragmas -DNDEBUG -D_UNICODE -D__SYMBIAN32__ -D__GCC32__ -D__EPOC32__ -D__MARM__ -D__MARM_ARMI__ -D__DLL__ -I "..\SRC" -I "..\INC" -I "..\..\..\EPOC32\INCLUDE" -o ..\..\..\EPOC32\BUILD\BIN\SYMBIAN\7.0S\NOKIA_6600_CAMERA_PLUGIN\SERIES60EX\CAMERASNAPSHOT\GROUP\CAMERASNAPSHOT\ARMI\UREL\CAMERASNAPSHOT.o "..\SRC\Camerasnapshot.cpp"
    (D:\Bin\Symbian\7.0s\Nokia_6600_Camera_Plugin\EPOC32\gcc\bin\gcc.exe 1000) Exception: STATUS_ACCESS_VIOLATION
    (D:\Bin\Symbian\7.0s\Nokia_6600_Camera_Plugin\EPOC32\gcc\bin\gcc.exe 1000) Dumping stack trace to gcc.exe.core
    make: *** [..\..\..\EPOC32\BUILD\BIN\SYMBIAN\7.0S\NOKIA_6600_CAMERA_PLUGIN\SERIES60EX\CAMERASNAPSHOT\GROUP\CAMERASNAPSHOT\ARMI\UREL\CAMERASNAPSHOT.o] Error 98304
    ERROR: RCMake failed: (Make): make command exited with result 2
    Project : error PRJ0019: tool suite is "generating file items"
    **
    Note: My vs.net is Chinese version, so I translate the error message to English for easier understanding.


    Anyone have similar problems with NDS? It looks quite odd,

    Thanks for help

    Huang

  2. #2
    Super Contributor
    Join Date
    Sep 2004
    Posts
    1,048
    Hi,

    As has been discussed in some other topics, unfortunately NDS only supports the English version of Visual Studio.

  3. #3
    Registered User
    Join Date
    Nov 2006
    Posts
    1

    Re: Problems with NDS_symbian_ vs 1.1, cannot complied examples in SDK

    I have succeeded to bypass the "gcc.exe 1000) Dumping stack trace to gcc.exe.core" and "gcc.exe 1000) Exception: STATUS_ACCESS_VIOLATION" errors by placing my sample in a reduced hierarchy directory.
    example: "z:\SymbianOS\6.1\S60\samples\*" to "z:\samples\*"

    the re-installation of activeperl do not solve this problem.

    If anybody have any solution, please......

    a++
    Nico&Co.

Posting Permissions

  • You may not post new threads
  • You may not post replies
  • You may not post attachments
  • You may not edit your posts
  •