×

Discussion Board

Results 1 to 4 of 4
  1. #1
    Registered User
    Join Date
    Mar 2005
    Posts
    3

    Unble to Open Nokia Project in VS.NET 2003(Eng Ver)

    Hello

    First I installed VS.NET English Version

    Then I install Nokia development Suit. File name is nds_symbian_vs_11.exe.

    During installation, installer fire error

    C:\Document and Setting\tushar\Local
    Setting\Temp\l1118395944\Windows>regsvr32 /s
    "C:\Nokia\Tools\NDS_forSymbianOD_VS\RegCheck.dll"

    Error Output is:'regsvr32' is not recognized as an internal or external
    command.
    Oprable program or batch file.

    Note! This action mast be carried out mannually product is usable!

    And VS.NET fires error
    like
    Error com.nokia.iguana.care.ProductRegistration threw an Exception

    Please help me
    Tushar P.

    Thanks in Advance

  2. #2
    Super Contributor
    Join Date
    Sep 2004
    Posts
    1,048
    Hello,

    Regsvr32 is a Windows utility to register certain components into the WIndows registry. It is a standard part of Windows and not supplied by NDS, therefore the NDS installer assumes that it is available.

    For some reason the call to regsvr32 fails in the installation. As a result the required components are not available at runtime thus resulting in the runtime exception you reported. The error doesn't really give any idea about why the call to regsrv32 fails.

    Does the regsvr32.exe file exist on your machine? It should be in the system32 directory under your windows root. Can you run regsrv32 from the Start->Run window? If you just type "regsvr32" in the Run window you should see an error message about a missing dll pop up if all is OK. If this is not the case, then that would explain the installer behaviour. Once any possibe problem with regsvr32 has been fixed (whatever it may be), uninstalling and reinstalling NDS should fix the situation.

  3. #3
    Registered User
    Join Date
    Mar 2005
    Posts
    3

    Compiler Error fatal error C1083: Cannot open include file

    Compiler Error fatal error C1083: Cannot open include file

    This error occure for
    1) SymbianDocument.h
    2) SymbianContainer.h
    3) SymbianAppui.h
    4) SymbianApp.h
    5) E32STD.h

    First 4 are in inc folder.

    In .mmp file contains

    USERINCLUDE .
    USERINCLUDE ..\inc

    SYSTEMINCLUDE . \epoc32\include

    I tried to change this configuartion but fail ed to remove error.

    Please help me

    Thanks in Advace.

    Tushar P.

  4. #4
    Registered User
    Join Date
    Mar 2005
    Posts
    3

    Compilation Error for HelloWorld Template Project in VS.NET

    Hello

    VS.NET 2003 (English Version) fires following error

    Updating MySample.mmp based on Deb_S60_20_WINS
    Update of mmp file not needed
    WINS (emulator) build
    ------ Build started: Project: Symbian1, Configuration: Deb_S60_20_WINS Win32 ------

    Performing Pre-Build Event...
    * Current build configuration: WINS UDEB
    java.lang.InternalError: Not Supported
    at System.Security.Util.StringExpressionSet.CanonicalizePath(String path, Boolean needFullPath)
    at System.Security.Util.StringExpressionSet.AddExpressions(String[] str, Boolean checkForDuplicates, Boolean needFullPath)
    at System.Security.Permissions.FileIOPermission.AddPathList(FileIOPermissionAccess access, String[] pathListOrig, Boolean checkForDuplicates, Boolean needFullPath, Boolean copyPathList)
    at System.Security.Permissions.FileIOPermission.<init>(FileIOPermissionAccess access, String path)
    at java.io.File.getAbsolutePath()
    at java.io.File.getCanonicalPath()
    at java.io.File.<init>(String dirPath, String name)
    at java.io.File.<init>(String path)
    at com.nokia.iguana.tools.rcmake.RCMakeMain.runWins()
    at com.nokia.iguana.tools.rcmake.RCMakeMain.Run()
    at com.nokia.iguana.tools.rcmake.RCMakeMain.main(String[] args)
    Symbian1 : error PRJ0007 : Could not create output directory 'c:\program files\microsoft visual studio .net 2003\common7\ide\!c:\symbian\7.0s\series60_v20\\epoc32\release\wins\udeb\z\\system\apps\mysample'.
    Performing Custom Build Step
    * Current build configuration: WINS UDEB
    java.lang.InternalError: Not Supported
    at System.Security.Util.StringExpressionSet.CanonicalizePath(String path, Boolean needFullPath)
    at System.Security.Util.StringExpressionSet.AddExpressions(String[] str, Boolean checkForDuplicates, Boolean needFullPath)
    at System.Security.Permissions.FileIOPermission.AddPathList(FileIOPermissionAccess access, String[] pathListOrig, Boolean checkForDuplicates, Boolean needFullPath, Boolean copyPathList)
    at System.Security.Permissions.FileIOPermission.<init>(FileIOPermissionAccess access, String path)
    at java.io.File.getAbsolutePath()
    at java.io.File.getCanonicalPath()
    at java.io.File.<init>(String dirPath, String name)
    at java.io.File.<init>(String path)
    at com.nokia.iguana.tools.rcmake.RCMakeMain.runWins()
    at com.nokia.iguana.tools.rcmake.RCMakeMain.Run()
    at com.nokia.iguana.tools.rcmake.RCMakeMain.main(String[] args)
    Performing Custom Build Step
    * Current build configuration: WINS UDEB
    java.lang.InternalError: Not Supported
    at System.Security.Util.StringExpressionSet.CanonicalizePath(String path, Boolean needFullPath)
    at System.Security.Util.StringExpressionSet.AddExpressions(String[] str, Boolean checkForDuplicates, Boolean needFullPath)
    at System.Security.Permissions.FileIOPermission.AddPathList(FileIOPermissionAccess access, String[] pathListOrig, Boolean checkForDuplicates, Boolean needFullPath, Boolean copyPathList)
    at System.Security.Permissions.FileIOPermission.<init>(FileIOPermissionAccess access, String path)
    at java.io.File.getAbsolutePath()
    at java.io.File.getCanonicalPath()
    at java.io.File.<init>(String dirPath, String name)
    at java.io.File.<init>(String path)
    at com.nokia.iguana.tools.rcmake.RCMakeMain.runWins()
    at com.nokia.iguana.tools.rcmake.RCMakeMain.Run()
    at com.nokia.iguana.tools.rcmake.RCMakeMain.main(String[] args)
    Performing Custom Build Step
    * Current build configuration: WINS UDEB
    java.lang.InternalError: Not Supported
    at System.Security.Util.StringExpressionSet.CanonicalizePath(String path, Boolean needFullPath)
    at System.Security.Util.StringExpressionSet.AddExpressions(String[] str, Boolean checkForDuplicates, Boolean needFullPath)
    at System.Security.Permissions.FileIOPermission.AddPathList(FileIOPermissionAccess access, String[] pathListOrig, Boolean checkForDuplicates, Boolean needFullPath, Boolean copyPathList)
    at System.Security.Permissions.FileIOPermission.<init>(FileIOPermissionAccess access, String path)
    at java.io.File.getAbsolutePath()
    at java.io.File.getCanonicalPath()
    at java.io.File.<init>(String dirPath, String name)
    at java.io.File.<init>(String path)
    at com.nokia.iguana.tools.rcmake.RCMakeMain.runWins()
    at com.nokia.iguana.tools.rcmake.RCMakeMain.Run()
    at com.nokia.iguana.tools.rcmake.RCMakeMain.main(String[] args)
    Compiling...
    mysample.uid.cpp
    .\group\mysample.uid.cpp(2) : fatal error C1083: Cannot open include file: 'E32STD.H': Invalid argument
    MySampleView2.cpp
    .\src\MySampleView2.cpp(12) : fatal error C1083: Cannot open include file: 'aknviewappui.h': Invalid argument
    MySampleView.cpp
    .\src\MySampleView.cpp(12) : fatal error C1083: Cannot open include file: 'aknviewappui.h': Invalid argument
    MySampleDocument.cpp
    c:\Documents and Settings\tushar\Desktop\Test\Symbian1\Symbian1\inc\MySampleDocument.h(15) : fatal error C1083: Cannot open include file: 'akndoc.h': Invalid argument
    MySampleContainer2.cpp
    c:\Documents and Settings\tushar\Desktop\Test\Symbian1\Symbian1\inc\MySampleContainer2.h(15) : fatal error C1083: Cannot open include file: 'coecntrl.h': Invalid argument
    MySampleContainer.cpp
    c:\Documents and Settings\tushar\Desktop\Test\Symbian1\Symbian1\inc\MySampleContainer.h(15) : fatal error C1083: Cannot open include file: 'coecntrl.h': Invalid argument
    MySampleAppUi.cpp
    c:\Documents and Settings\tushar\Desktop\Test\Symbian1\Symbian1\inc\MySampleAppui.h(15) : fatal error C1083: Cannot open include file: 'aknviewappui.h': Invalid argument
    MySampleApp.cpp
    c:\Documents and Settings\tushar\Desktop\Test\Symbian1\Symbian1\inc\MySampleApp.h(15) : fatal error C1083: Cannot open include file: 'aknapp.h': Invalid argument
    Generating Code...

    Build log was saved at "file://c:\Documents and Settings\tushar\Desktop\Test\Symbian1\Symbian1\Deb_S60_20_WINS\BuildLog.htm"
    Symbian1 - 9 error(s), 0 warning(s)


    ---------------------- Done ----------------------

    Build: 0 succeeded, 1 failed, 0 skipped

    Will any one explain me this error?
    What is solution for it?

    Thanks in Advace

    Tushar P.

Posting Permissions

  • You may not post new threads
  • You may not post replies
  • You may not post attachments
  • You may not edit your posts
  •  
×